Reaction Details
TargetCarbonic anhydrase 4
LigandBDBM50162817
Substrate/Competitorn/a
Meas. Tech.ChEMBL_303009 (CHEMBL830248)
Ki 3180000±n/a nM
Citation Winum, JYInnocenti, AGagnard, VMontero, JLScozzafava, AVullo, DSupuran, CT Carbonic anhydrase inhibitors. Interaction of isozymes I, II, IV, V, and IX with organic phosphates and phosphonates. Bioorg Med Chem Lett15:1683-6 (2005) 
 
Carbonic anhydrase 4
Name:Carbonic anhydrase 4
Type:Enzyme
Mol. Mass.:35037.98
Organism:Homo sapiens (Human)
Description:P22748
Residue:312
BDBM50162817
NameBDBM50162817
Synonyms:2-Amino-3-phosphonooxy-butyric acid | CHEMBL369507
TypeSmall organic molecule
Emp. Form.C4H10NO6P
Mol. Mass.199.0991
SMILESCC(OP(O)(O)=O)C(N)C(O)=O