Reaction Details
TargetProstaglandin D2 receptor 2
LigandBDBM50162894
Substrate/Competitorn/a
Meas. Tech.ChEMBL_313011 (CHEMBL874205)
IC50 22±n/a nM
Citation Robarge, MJBom, DCTumey, LNVarga, NGleason, ESilver, DSong, JMurphy, SMEkema, GDoucette, CHanniford, DPalmer, MPawlowski, GDanzig, JLoftus, MHunady, KSherf, BAMays, RWStricker-Krongrad, ABrunden, KRHarrington, JJBennani, YL Isosteric ramatroban analogs: selective and potent CRTH-2 antagonists. Bioorg Med Chem Lett15:1749-53 (2005) 
 
Prostaglandin D2 receptor 2
Name:Prostaglandin D2 receptor 2
Type:Enzyme
Mol. Mass.:43295.45
Organism:Homo sapiens (Human)
Description:Q9Y5Y4
Residue:395
BDBM50162894
NameBDBM50162894
Synonyms:CHEMBL361972 | [2-(4-Fluoro-benzenesulfonylamino)-6,7,8,9,10,10a-hexahydro-5aH-cyclohepta[b]indol-5-yl]-acetic acid
TypeSmall organic molecule
Emp. Form.C21H23FN2O4S
Mol. Mass.418.482
SMILESOC(=O)CN1C2CCCCCC2c2cc(NS(=O)(=O)c3ccc(F)cc3)ccc12