Reaction Details
TargetProstaglandin D2 receptor 2
LigandBDBM50162898
Substrate/Competitorn/a
Meas. Tech.ChEMBL_308687 (CHEMBL834127)
Ki 2400±n/a nM
Citation Robarge, MJBom, DCTumey, LNVarga, NGleason, ESilver, DSong, JMurphy, SMEkema, GDoucette, CHanniford, DPalmer, MPawlowski, GDanzig, JLoftus, MHunady, KSherf, BAMays, RWStricker-Krongrad, ABrunden, KRHarrington, JJBennani, YL Isosteric ramatroban analogs: selective and potent CRTH-2 antagonists. Bioorg Med Chem Lett15:1749-53 (2005) 
 
Prostaglandin D2 receptor 2
Name:Prostaglandin D2 receptor 2
Type:Enzyme
Mol. Mass.:43295.45
Organism:Homo sapiens (Human)
Description:Q9Y5Y4
Residue:395
BDBM50162898
NameBDBM50162898
Synonyms:2-[6-(4-Fluoro-benzenesulfonylamino)-1,2,3,4-tetrahydro-carbazol-9-yl]-ethanesulfonic acid | CHEMBL362180
TypeSmall organic molecule
Emp. Form.C20H21FN2O5S2
Mol. Mass.452.52
SMILESOS(=O)(=O)CCn1c2CCCCc2c2cc(NS(=O)(=O)c3ccc(F)cc3)ccc12