Reaction Details
TargetProstaglandin D2 receptor 2
LigandBDBM50162891
Substrate/Competitorn/a
Meas. Tech.ChEMBL_308693 (CHEMBL875722)
Ki 50±n/a nM
Citation Robarge, MJBom, DCTumey, LNVarga, NGleason, ESilver, DSong, JMurphy, SMEkema, GDoucette, CHanniford, DPalmer, MPawlowski, GDanzig, JLoftus, MHunady, KSherf, BAMays, RWStricker-Krongrad, ABrunden, KRHarrington, JJBennani, YL Isosteric ramatroban analogs: selective and potent CRTH-2 antagonists. Bioorg Med Chem Lett15:1749-53 (2005) 
 
Prostaglandin D2 receptor 2
Name:Prostaglandin D2 receptor 2
Type:Enzyme
Mol. Mass.:43295.45
Organism:Homo sapiens (Human)
Description:Q9Y5Y4
Residue:395
BDBM50162891
NameBDBM50162891
Synonyms:CHEMBL179980 | [6-(4-Fluoro-benzenesulfonylamino)-3-phenyl-1,2,3,4-tetrahydro-carbazol-9-yl]-acetic acid
TypeSmall organic molecule
Emp. Form.C26H23FN2O4S
Mol. Mass.478.535
SMILESOC(=O)Cn1c2CCC(Cc2c2cc(NS(=O)(=O)c3ccc(F)cc3)ccc12)c1ccccc1