Reaction Details
TargetD(2) dopamine receptor
LigandBDBM50137976
Substrate/Competitorn/a
Meas. Tech.ChEMBL_303035 (CHEMBL828863)
Ki 17.2±n/a nM
Citation Campiani, GButini, SFattorusso, CTrotta, FGemma, SCatalanotti, BNacci, VFiorini, ICagnotto, AMereghetti, IMennini, TMinetti, PDi Cesare, MAStasi, MADi Serio, SGhirardi, OTinti, OCarminati, P Novel atypical antipsychotic agents: rational design, an efficient palladium-catalyzed route, and pharmacological studies. J Med Chem48:1705-8 (2005) 
 
D(2) dopamine receptor
Name:D(2) dopamine receptor
Type:G Protein-Coupled Receptor (GPCR)
Mol. Mass.:50931.60
Organism:Rattus norvegicus (rat)
Description:P61169
Residue:444
BDBM50137976
NameBDBM50137976
Synonyms:9-(4-Methyl-piperazin-1-yl)-4-thia-10a-aza-benzo[f]azulene | CHEMBL367045
TypeSmall organic molecule
Emp. Form.C17H19N3S
Mol. Mass.297.418
SMILESCN1CCN(CC1)C1=Cn2cccc2Sc2ccccc12