Reaction Details
TargetHistamine H1 receptor
LigandBDBM50162964
Substrate/Competitorn/a
Meas. Tech.ChEMBL_303185 (CHEMBL829679)
Ki 1.2±n/a nM
Citation Fernández, JAlonso, JMAndrés, JICid, JMDíaz, AIturrino, LGil, PMegens, ASipido, VKTrabanco, AA Discovery of new tetracyclic tetrahydrofuran derivatives as potential broad-spectrum psychotropic agents. J Med Chem48:1709-12 (2005) 
 
Histamine H1 receptor
Name:Histamine H1 receptor
Type:G Protein-Coupled Receptor (GPCR)
Mol. Mass.:55808.72
Organism:Homo sapiens (Human)
Description:Cell pellets from SK-N-MC cells transfected with human H1 receptor were used in binding assay.
Residue:487
BDBM50162964
NameBDBM50162964
Synonyms:(11-Fluoro-2,3,3a,12b-tetrahydro-1-oxa-8-thia-dibenzo[e,h]azulen-2-ylmethyl)-dimethyl-amine | CHEMBL363581
TypeSmall organic molecule
Emp. Form.C19H20FNOS
Mol. Mass.329.432
SMILESCN(C)C[C@@H]1CC2[C@H](O1)c1cc(F)ccc1Sc1ccccc21