Reaction Details
TargetProtein kinase C alpha type
LigandBDBM50163000
Substrate/Competitorn/a
Meas. Tech.ChEMBL_305791 (CHEMBL827979)
IC50 320±n/a nM
Citation Zhang, HCDerian, CKMcComsey, DFWhite, KBYe, HHecker, LRLi, JAddo, MFCroll, DEckardt, AJSmith, CELi, QCheung, WMConway, BREmanuel, SDemarest, KTAndrade-Gordon, PDamiano, BPMaryanoff, BE Novel indolylindazolylmaleimides as inhibitors of protein kinase C-beta: synthesis, biological activity, and cardiovascular safety. J Med Chem48:1725-8 (2005) 
 
Protein kinase C alpha type
Name:Protein kinase C alpha type
Type:Enzyme
Mol. Mass.:76755.65
Organism:Homo sapiens (Human)
Description:The recombinant human PKC enzymes were produced using a baculovirus expression system in SF9 cells
Residue:672
BDBM50163000
NameBDBM50163000
Synonyms:3-(1-Piperazin-1-yl-1H-indazol-3-yl)-4-[1-(1,4,4a,8a-tetrahydro-naphthalen-2-yl)-1H-indol-3-yl]-pyrrole-2,5-dione | CHEMBL175845
TypeSmall organic molecule
Emp. Form.C37H34N6O2
Mol. Mass.594.7049
SMILESCN1CCN(CCCn2nc(C3=C(C(=O)NC3=O)c3cn(-c4ccc5ccccc5c4)c4ccccc34)c3ccccc23)CC1