Reaction Details
TargetProtein kinase C beta type
LigandBDBM50162993
Substrate/Competitorn/a
Meas. Tech.ChEMBL_305829 (CHEMBL829571)
IC50 7±n/a nM
Citation Zhang, HCDerian, CKMcComsey, DFWhite, KBYe, HHecker, LRLi, JAddo, MFCroll, DEckardt, AJSmith, CELi, QCheung, WMConway, BREmanuel, SDemarest, KTAndrade-Gordon, PDamiano, BPMaryanoff, BE Novel indolylindazolylmaleimides as inhibitors of protein kinase C-beta: synthesis, biological activity, and cardiovascular safety. J Med Chem48:1725-8 (2005) 
 
Protein kinase C beta type
Name:Protein kinase C beta type
Type:Enzyme
Mol. Mass.:76873.67
Organism:Homo sapiens (Human)
Description:The recombinant human PKC enzymes were produced using a baculovirus expression system in SF9 cells
Residue:671
BDBM50162993
NameBDBM50162993
Synonyms:3-[1-(3-Dimethylamino-propyl)-1H-indazol-3-yl]-4-(1-pyridin-3-yl-1H-indol-3-yl)-pyrrole-2,5-dione | CHEMBL368416
TypeSmall organic molecule
Emp. Form.C29H26N6O2
Mol. Mass.490.5557
SMILESCN(C)CCCn1nc(C2=C(C(=O)NC2=O)c2cn(-c3cccnc3)c3ccccc23)c2ccccc12