Reaction Details
TargetPlatelet-derived growth factor receptor alpha/beta
LigandBDBM50162991
Substrate/Competitorn/a
Meas. Tech.ChEMBL_305880 (CHEMBL832743)
IC50>10000±n/a nM
Citation Zhang, HCDerian, CKMcComsey, DFWhite, KBYe, HHecker, LRLi, JAddo, MFCroll, DEckardt, AJSmith, CELi, QCheung, WMConway, BREmanuel, SDemarest, KTAndrade-Gordon, PDamiano, BPMaryanoff, BE Novel indolylindazolylmaleimides as inhibitors of protein kinase C-beta: synthesis, biological activity, and cardiovascular safety. J Med Chem48:1725-8 (2005) 
 
Platelet-derived growth factor receptor alpha/beta
Name:Platelet-derived growth factor receptor alpha/beta
Type:n/a
Mol. Mass.:n/a
Description:ASSAY_ID of EBI is 454
Components:This complex has 2 components.
Component 1
Name:Platelet-derived growth factor receptor beta
Synonyms:2.7.10.1 Beta-type platelet-derived growth factor receptor CD140b antigen PDGF-R-beta PDGFR-beta Pdgfr Pdgfrb Platelet-derived growth factor receptor | Platelet-derived growth factor receptor 1
Type:Enzyme
Mol. Mass.:122771.00
Organism:Mus musculus (mouse)
Description:P05622
Residue:1098
Component 2
Name:Platelet-derived growth factor receptor alpha
Synonyms:PGFRA_MOUSE Platelet-derived growth factor receptor
Type:PROTEIN
Mol. Mass.:122646.66
Organism:Mus musculus
Description:EBI_12628
Residue:1089
BDBM50162991
NameBDBM50162991
Synonyms:3-(1-Benzo[b]thiophen-2-yl-1H-indol-3-yl)-4-[1-(3-dimethylamino-propyl)-1H-indazol-3-yl]-pyrrole-2,5-dione | CHEMBL426587
TypeSmall organic molecule
Emp. Form.C32H27N5O2S
Mol. Mass.545.654
SMILESCN(C)CCCn1nc(C2=C(C(=O)NC2=O)c2cn(-c3csc4ccccc34)c3ccccc23)c2ccccc12