Reaction Details
TargetProtein kinase C alpha type
LigandBDBM50163002
Substrate/Competitorn/a
Meas. Tech.ChEMBL_305791 (CHEMBL827979)
IC50 260±n/a nM
Citation Zhang, HCDerian, CKMcComsey, DFWhite, KBYe, HHecker, LRLi, JAddo, MFCroll, DEckardt, AJSmith, CELi, QCheung, WMConway, BREmanuel, SDemarest, KTAndrade-Gordon, PDamiano, BPMaryanoff, BE Novel indolylindazolylmaleimides as inhibitors of protein kinase C-beta: synthesis, biological activity, and cardiovascular safety. J Med Chem48:1725-8 (2005) 
 
Protein kinase C alpha type
Name:Protein kinase C alpha type
Type:Enzyme
Mol. Mass.:76755.65
Organism:Homo sapiens (Human)
Description:The recombinant human PKC enzymes were produced using a baculovirus expression system in SF9 cells
Residue:672
BDBM50163002
NameBDBM50163002
Synonyms:3-(1-Morpholin-2-yl-1H-indazol-3-yl)-4-[1-(1,4,4a,8a-tetrahydro-naphthalen-2-yl)-1H-indol-3-yl]-pyrrole-2,5-dione | CHEMBL367106
TypeSmall organic molecule
Emp. Form.C36H31N5O3
Mol. Mass.581.663
SMILESO=C1NC(=O)C(=C1c1cn(-c2ccc3ccccc3c2)c2ccccc12)c1nn(CCCN2CCOCC2)c2ccccc12