Reaction Details
TargetProtein kinase C beta type
LigandBDBM50162997
Substrate/Competitorn/a
Meas. Tech.ChEMBL_305828 (CHEMBL829570)
IC50 460±n/a nM
Citation Zhang, HCDerian, CKMcComsey, DFWhite, KBYe, HHecker, LRLi, JAddo, MFCroll, DEckardt, AJSmith, CELi, QCheung, WMConway, BREmanuel, SDemarest, KTAndrade-Gordon, PDamiano, BPMaryanoff, BE Novel indolylindazolylmaleimides as inhibitors of protein kinase C-beta: synthesis, biological activity, and cardiovascular safety. J Med Chem48:1725-8 (2005) 
 
Protein kinase C beta type
Name:Protein kinase C beta type
Type:Enzyme
Mol. Mass.:76873.67
Organism:Homo sapiens (Human)
Description:The recombinant human PKC enzymes were produced using a baculovirus expression system in SF9 cells
Residue:671
BDBM50162997
NameBDBM50162997
Synonyms:3-(1H-Indazol-3-yl)-4-(1-pyridin-3-yl-1H-indol-3-yl)-pyrrole-2,5-dione | CHEMBL175956
TypeSmall organic molecule
Emp. Form.C24H15N5O2
Mol. Mass.405.4082
SMILESO=C1NC(=O)C(=C1c1cn(-c2cccnc2)c2ccccc12)c1[nH]nc2ccccc12