Reaction Details
TargetMitogen-activated protein kinase 1
LigandBDBM50162998
Substrate/Competitorn/a
Meas. Tech.ChEMBL_306271 (CHEMBL827548)
IC50>10000±n/a nM
Citation Zhang, HCDerian, CKMcComsey, DFWhite, KBYe, HHecker, LRLi, JAddo, MFCroll, DEckardt, AJSmith, CELi, QCheung, WMConway, BREmanuel, SDemarest, KTAndrade-Gordon, PDamiano, BPMaryanoff, BE Novel indolylindazolylmaleimides as inhibitors of protein kinase C-beta: synthesis, biological activity, and cardiovascular safety. J Med Chem48:1725-8 (2005) 
 
Mitogen-activated protein kinase 1
Name:Mitogen-activated protein kinase 1
Type:Protein
Mol. Mass.:41278.65
Organism:Mus musculus (Mouse)
Description:P63085
Residue:358
BDBM50162998
NameBDBM50162998
Synonyms:3-[1-(3-Dimethylamino-propyl)-1H-indazol-3-yl]-4-(1-thiophen-2-yl-1H-indol-3-yl)-pyrrole-2,5-dione | CHEMBL178945
TypeSmall organic molecule
Emp. Form.C28H25N5O2S
Mol. Mass.495.595
SMILESCN(C)CCCn1nc(C2=C(C(=O)NC2=O)c2cn(-c3cccs3)c3ccccc23)c2ccccc12