Reaction Details
TargetPotassium voltage-gated channel subfamily H member 2
LigandBDBM50163002
Substrate/Competitorn/a
Meas. Tech.ChEMBL_304829 (CHEMBL827917)
Ki 850.0±n/a nM
Citation Zhang, HCDerian, CKMcComsey, DFWhite, KBYe, HHecker, LRLi, JAddo, MFCroll, DEckardt, AJSmith, CELi, QCheung, WMConway, BREmanuel, SDemarest, KTAndrade-Gordon, PDamiano, BPMaryanoff, BE Novel indolylindazolylmaleimides as inhibitors of protein kinase C-beta: synthesis, biological activity, and cardiovascular safety. J Med Chem48:1725-8 (2005) 
 
Potassium voltage-gated channel subfamily H member 2
Name:Potassium voltage-gated channel subfamily H member 2
Type:Multi-pass membrane protein
Mol. Mass.:126672.65
Organism:Homo sapiens (Human)
Description:Q12809
Residue:1159
BDBM50163002
NameBDBM50163002
Synonyms:3-(1-Morpholin-2-yl-1H-indazol-3-yl)-4-[1-(1,4,4a,8a-tetrahydro-naphthalen-2-yl)-1H-indol-3-yl]-pyrrole-2,5-dione | CHEMBL367106
TypeSmall organic molecule
Emp. Form.C36H31N5O3
Mol. Mass.581.663
SMILESO=C1NC(=O)C(=C1c1cn(-c2ccc3ccccc3c2)c2ccccc12)c1nn(CCCN2CCOCC2)c2ccccc12