Reaction Details
TargetProtein kinase C gamma type
LigandBDBM50163001
Substrate/Competitorn/a
Meas. Tech.ChEMBL_305792 (CHEMBL827980)
IC50 370±n/a nM
Citation Zhang, HCDerian, CKMcComsey, DFWhite, KBYe, HHecker, LRLi, JAddo, MFCroll, DEckardt, AJSmith, CELi, QCheung, WMConway, BREmanuel, SDemarest, KTAndrade-Gordon, PDamiano, BPMaryanoff, BE Novel indolylindazolylmaleimides as inhibitors of protein kinase C-beta: synthesis, biological activity, and cardiovascular safety. J Med Chem48:1725-8 (2005) 
 
Protein kinase C gamma type
Name:Protein kinase C gamma type
Type:Enzyme
Mol. Mass.:78458.05
Organism:Homo sapiens (Human)
Description:The recombinant human PKC enzymes were produced using a baculovirus expression system in SF9 cells
Residue:697
BDBM50163001
NameBDBM50163001
Synonyms:3-[1-(3-Dimethylamino-propyl)-1H-indazol-3-yl]-4-(1-phenyl-1H-indol-3-yl)-pyrrole-2,5-dione | CHEMBL366668
TypeSmall organic molecule
Emp. Form.C30H27N5O2
Mol. Mass.489.5677
SMILESCN(C)CCCn1nc(C2=C(C(=O)NC2=O)c2cn(-c3ccccc3)c3ccccc23)c2ccccc12