Reaction Details
TargetEpidermal growth factor receptor
LigandBDBM50162998
Substrate/Competitorn/a
Meas. Tech.ChEMBL_305656 (CHEMBL829514)
IC50>10000±n/a nM
Citation Zhang, HCDerian, CKMcComsey, DFWhite, KBYe, HHecker, LRLi, JAddo, MFCroll, DEckardt, AJSmith, CELi, QCheung, WMConway, BREmanuel, SDemarest, KTAndrade-Gordon, PDamiano, BPMaryanoff, BE Novel indolylindazolylmaleimides as inhibitors of protein kinase C-beta: synthesis, biological activity, and cardiovascular safety. J Med Chem48:1725-8 (2005) 
 
Epidermal growth factor receptor
Name:Epidermal growth factor receptor
Type:PROTEIN
Mol. Mass.:134859.02
Organism:Mus musculus
Description:ChEMBL_305656
Residue:1210
BDBM50162998
NameBDBM50162998
Synonyms:3-[1-(3-Dimethylamino-propyl)-1H-indazol-3-yl]-4-(1-thiophen-2-yl-1H-indol-3-yl)-pyrrole-2,5-dione | CHEMBL178945
TypeSmall organic molecule
Emp. Form.C28H25N5O2S
Mol. Mass.495.595
SMILESCN(C)CCCn1nc(C2=C(C(=O)NC2=O)c2cn(-c3cccs3)c3ccccc23)c2ccccc12