Reaction Details
Target5-hydroxytryptamine receptor 6
LigandBDBM34143
Substrate/Competitorn/a
Meas. Tech.ChEMBL_303258 (CHEMBL826384)
Ki 0.2±n/a nM
Citation Holenz, JMercè, RDíaz, JLGuitart, XCodony, XDordal, ARomero, GTorrens, AMas, JAndaluz, BHernández, SMonroy, XSánchez, EHernández, EPérez, RCubí, RSanfeliu, OBuschmann, H Medicinal chemistry driven approaches toward novel and selective serotonin 5-HT6 receptor ligands. J Med Chem48:1781-95 (2005) 
 
5-hydroxytryptamine receptor 6
Name:5-hydroxytryptamine receptor 6
Type:G Protein-Coupled Receptor (GPCR)
Mol. Mass.:46968.43
Organism:Homo sapiens (Human)
Description:P50406
Residue:440
BDBM34143
NameBDBM34143
Synonyms:CHEMBL175835 | E-6837
TypeSmall organic molecule
Emp. Form.C22H22ClN3O2S
Mol. Mass.427.947
SMILESCN(C)CCc1c[nH]c2ccc(NS(=O)(=O)c3ccc4c(Cl)cccc4c3)cc12