Reaction Details
TargetFatty-acid amide hydrolase 1 [30-579]
LigandBDBM50163168
Substrate/Competitorn/a
Meas. Tech.ChEMBL_303638 (CHEMBL828848)
Ki 13±n/a nM
Citation Boger, DLMiyauchi, HDu, WHardouin, CFecik, RACheng, HHwang, IHedrick, MPLeung, DAcevedo, OGuimarães, CRJorgensen, WLCravatt, BF Discovery of a potent, selective, and efficacious class of reversible alpha-ketoheterocycle inhibitors of fatty acid amide hydrolase effective as analgesics. J Med Chem48:1849-56 (2005) 
 
Fatty-acid amide hydrolase 1 [30-579]
Name:Fatty-acid amide hydrolase 1 [30-579]
Type:Single-pass membrane protein; homodimer
Mol. Mass.:60474.00
Organism:Rattus norvegicus (rat)
Description:P97612 (aa 30-579)
Residue:550
BDBM50163168
NameBDBM50163168
Synonyms:1-(5-Pyridin-2-yl-oxazol-2-yl)-tetradecan-1-one | CHEMBL175695
TypeSmall organic molecule
Emp. Form.C22H32N2O2
Mol. Mass.356.5017
(=O)c1ncc(o1)-c1ccccn1