Reaction Details
TargetFatty-acid amide hydrolase 1 [30-579]
LigandBDBM50163186
Substrate/Competitorn/a
Meas. Tech.ChEMBL_303638 (CHEMBL828848)
Ki 4.6±n/a nM
Citation Boger, DLMiyauchi, HDu, WHardouin, CFecik, RACheng, HHwang, IHedrick, MPLeung, DAcevedo, OGuimarães, CRJorgensen, WLCravatt, BF Discovery of a potent, selective, and efficacious class of reversible alpha-ketoheterocycle inhibitors of fatty acid amide hydrolase effective as analgesics. J Med Chem48:1849-56 (2005) 
 
Fatty-acid amide hydrolase 1 [30-579]
Name:Fatty-acid amide hydrolase 1 [30-579]
Type:Single-pass membrane protein; homodimer
Mol. Mass.:60474.00
Organism:Rattus norvegicus (rat)
Description:P97612 (aa 30-579)
Residue:550
BDBM50163186
NameBDBM50163186
Synonyms:1-(5-(oxazol-2-yl)oxazol-2-yl)-7-phenylheptan-1-one CHEMBL176122
TypeSmall organic molecule
Emp. Form.C19H20N2O3
Mol. Mass.324.3737
SMILESO=C(CCCCCCc1ccccc1)c1ncc(o1)-c1ncco1