Reaction Details
TargetFatty-acid amide hydrolase 1 [30-579]
LigandBDBM50163202
Substrate/Competitorn/a
Meas. Tech.ChEMBL_303638 (CHEMBL828848)
Ki 5.3±n/a nM
Citation Boger, DLMiyauchi, HDu, WHardouin, CFecik, RACheng, HHwang, IHedrick, MPLeung, DAcevedo, OGuimarães, CRJorgensen, WLCravatt, BF Discovery of a potent, selective, and efficacious class of reversible alpha-ketoheterocycle inhibitors of fatty acid amide hydrolase effective as analgesics. J Med Chem48:1849-56 (2005) 
 
Fatty-acid amide hydrolase 1 [30-579]
Name:Fatty-acid amide hydrolase 1 [30-579]
Type:Single-pass membrane protein; homodimer
Mol. Mass.:60474.00
Organism:Rattus norvegicus (rat)
Description:P97612 (aa 30-579)
Residue:550
BDBM50163202
NameBDBM50163202
Synonyms:7-Phenyl-1-(5-pyrazin-2-yl-oxazol-2-yl)-heptan-1-one | CHEMBL177858
TypeSmall organic molecule
Emp. Form.C20H21N3O2
Mol. Mass.335.3996
SMILESO=C(CCCCCCc1ccccc1)c1ncc(o1)-c1cnccn1