Reaction Details
TargetSerine/threonine-protein kinase Chk2
LigandBDBM50163245
Substrate/Competitorn/a
Meas. Tech.ChEMBL_305572 (CHEMBL874429)
IC50 680±n/a nM
Citation Arienti, KLBrunmark, AAxe, FUMcClure, KLee, ABlevitt, JNeff, DKHuang, LCrawford, SPandit, CRKarlsson, LBreitenbucher, JG Checkpoint kinase inhibitors: SAR and radioprotective properties of a series of 2-arylbenzimidazoles. J Med Chem48:1873-85 (2005) 
 
Serine/threonine-protein kinase Chk2
Name:Serine/threonine-protein kinase Chk2
Type:Protein
Mol. Mass.:60908.59
Organism:Homo sapiens (Human)
Description:O96017
Residue:543
BDBM50163245
NameBDBM50163245
Synonyms:2-[4-(4-Chloro-phenylcarbamoyl)-phenyl]-1H-benzoimidazole-5-carboxylic acid amide | CHEMBL195598
TypeSmall organic molecule
Emp. Form.C21H15ClN4O2
Mol. Mass.390.822
SMILESNC(=O)c1ccc2nc([nH]c2c1)-c1ccc(cc1)C(=O)Nc1ccc(Cl)cc1