Reaction Details
TargetSerine/threonine-protein kinase Chk2
LigandBDBM50163253
Substrate/Competitorn/a
Meas. Tech.ChEMBL_305572 (CHEMBL874429)
IC50 32±n/a nM
Citation Arienti, KLBrunmark, AAxe, FUMcClure, KLee, ABlevitt, JNeff, DKHuang, LCrawford, SPandit, CRKarlsson, LBreitenbucher, JG Checkpoint kinase inhibitors: SAR and radioprotective properties of a series of 2-arylbenzimidazoles. J Med Chem48:1873-85 (2005) 
 
Serine/threonine-protein kinase Chk2
Name:Serine/threonine-protein kinase Chk2
Type:Protein
Mol. Mass.:60908.59
Organism:Homo sapiens (Human)
Description:O96017
Residue:543
BDBM50163253
NameBDBM50163253
Synonyms:2-(4-Benzyloxy-phenyl)-1H-benzoimidazole-5-carboxylic acid amide | CHEMBL192022
TypeSmall organic molecule
Emp. Form.C21H17N3O2
Mol. Mass.343.3786
SMILESNC(=O)c1ccc2nc([nH]c2c1)-c1ccc(OCc2ccccc2)cc1