Reaction Details
TargetSerine/threonine-protein kinase Chk2
LigandBDBM50163272
Substrate/Competitorn/a
Meas. Tech.ChEMBL_305572 (CHEMBL874429)
IC50 715±n/a nM
Citation Arienti, KLBrunmark, AAxe, FUMcClure, KLee, ABlevitt, JNeff, DKHuang, LCrawford, SPandit, CRKarlsson, LBreitenbucher, JG Checkpoint kinase inhibitors: SAR and radioprotective properties of a series of 2-arylbenzimidazoles. J Med Chem48:1873-85 (2005) 
 
Serine/threonine-protein kinase Chk2
Name:Serine/threonine-protein kinase Chk2
Type:Protein
Mol. Mass.:60908.59
Organism:Homo sapiens (Human)
Description:O96017
Residue:543
BDBM50163272
NameBDBM50163272
Synonyms:3-[4-(5-Carbamoyl-1H-benzoimidazol-2-yl)-phenoxy]-benzoic acid | CHEMBL381436
TypeSmall organic molecule
Emp. Form.C21H15N3O4
Mol. Mass.373.3615
SMILESNC(=O)c1ccc2nc([nH]c2c1)-c1ccc(Oc2cccc(c2)C(O)=O)cc1