Reaction Details
TargetSerine/threonine-protein kinase Chk2
LigandBDBM34064
Substrate/Competitorn/a
Meas. Tech.ChEMBL_305572 (CHEMBL874429)
IC50 16±n/a nM
Citation Arienti, KLBrunmark, AAxe, FUMcClure, KLee, ABlevitt, JNeff, DKHuang, LCrawford, SPandit, CRKarlsson, LBreitenbucher, JG Checkpoint kinase inhibitors: SAR and radioprotective properties of a series of 2-arylbenzimidazoles. J Med Chem48:1873-85 (2005) 
 
Serine/threonine-protein kinase Chk2
Name:Serine/threonine-protein kinase Chk2
Type:Protein
Mol. Mass.:60908.59
Organism:Homo sapiens (Human)
Description:O96017
Residue:543
BDBM34064
NameBDBM34064
Synonyms:2-arylbenzimidazole | CHEMBL179583
TypeSmall organic molecule
Emp. Form.C20H14ClN3O2
Mol. Mass.363.797
SMILESNC(=O)c1ccc2nc([nH]c2c1)-c1ccc(Oc2ccc(Cl)cc2)cc1