Reaction Details
TargetSerine/threonine-protein kinase Chk2
LigandBDBM50163287
Substrate/Competitorn/a
Meas. Tech.ChEMBL_305572 (CHEMBL874429)
IC50 41±n/a nM
Citation Arienti, KLBrunmark, AAxe, FUMcClure, KLee, ABlevitt, JNeff, DKHuang, LCrawford, SPandit, CRKarlsson, LBreitenbucher, JG Checkpoint kinase inhibitors: SAR and radioprotective properties of a series of 2-arylbenzimidazoles. J Med Chem48:1873-85 (2005) 
 
Serine/threonine-protein kinase Chk2
Name:Serine/threonine-protein kinase Chk2
Type:Protein
Mol. Mass.:60908.59
Organism:Homo sapiens (Human)
Description:O96017
Residue:543
BDBM50163287
NameBDBM50163287
Synonyms:2-[4-(4-Methanesulfonylamino-phenoxy)-phenyl]-1H-benzoimidazole-5-carboxylic acid amide | CHEMBL363339
TypeSmall organic molecule
Emp. Form.C21H18N4O4S
Mol. Mass.422.457
SMILESCS(=O)(=O)Nc1ccc(Oc2ccc(cc2)-c2nc3ccc(cc3[nH]2)C(N)=O)cc1