Reaction Details
TargetSerine/threonine-protein kinase Chk2
LigandBDBM50163283
Substrate/Competitorn/a
Meas. Tech.ChEMBL_305572 (CHEMBL874429)
IC50 6000±n/a nM
Citation Arienti, KLBrunmark, AAxe, FUMcClure, KLee, ABlevitt, JNeff, DKHuang, LCrawford, SPandit, CRKarlsson, LBreitenbucher, JG Checkpoint kinase inhibitors: SAR and radioprotective properties of a series of 2-arylbenzimidazoles. J Med Chem48:1873-85 (2005) 
 
Serine/threonine-protein kinase Chk2
Name:Serine/threonine-protein kinase Chk2
Type:Protein
Mol. Mass.:60908.59
Organism:Homo sapiens (Human)
Description:O96017
Residue:543
BDBM50163283
NameBDBM50163283
Synonyms:2-(4-Phenoxy-phenyl)-1H-benzoimidazole-4-carboxylic acid amide | CHEMBL176276
TypeSmall organic molecule
Emp. Form.C20H15N3O2
Mol. Mass.329.352
SMILESNC(=O)c1cccc2[nH]c(nc12)-c1ccc(Oc2ccccc2)cc1