Reaction Details
TargetSerine/threonine-protein kinase Chk2
LigandBDBM50163285
Substrate/Competitorn/a
Meas. Tech.ChEMBL_305572 (CHEMBL874429)
IC50 61±n/a nM
Citation Arienti, KLBrunmark, AAxe, FUMcClure, KLee, ABlevitt, JNeff, DKHuang, LCrawford, SPandit, CRKarlsson, LBreitenbucher, JG Checkpoint kinase inhibitors: SAR and radioprotective properties of a series of 2-arylbenzimidazoles. J Med Chem48:1873-85 (2005) 
 
Serine/threonine-protein kinase Chk2
Name:Serine/threonine-protein kinase Chk2
Type:Protein
Mol. Mass.:60908.59
Organism:Homo sapiens (Human)
Description:O96017
Residue:543
BDBM50163285
NameBDBM50163285
Synonyms:2-[4-(3-Hydroxy-phenoxy)-phenyl]-1H-benzoimidazole-5-carboxylic acid amide | CHEMBL367263
TypeSmall organic molecule
Emp. Form.C20H15N3O3
Mol. Mass.345.3514
SMILESNC(=O)c1ccc2nc([nH]c2c1)-c1ccc(Oc2cccc(O)c2)cc1