Reaction Details
TargetGag-Pol polyprotein [489-587]
LigandBDBM50163391
Substrate/Competitorn/a
Meas. Tech.ChEMBL_302211 (CHEMBL826984)
Kd 0.400000±n/a nM
Citation Surleraux, DLde Kock, HAVerschueren, WGPille, GMMaes, LJPeeters, AVendeville, SDe Meyer, SAzijn, HPauwels, Rde Bethune, MPKing, NMPrabu-Jeyabalan, MSchiffer, CAWigerinck, PB Design of HIV-1 protease inhibitors active on multidrug-resistant virus. J Med Chem48:1965-73 (2005) 
 
Gag-Pol polyprotein [489-587]
Name:Gag-Pol polyprotein [489-587]
Type:Enzyme Subunit
Mol. Mass.:10781.16
Organism:Human immunodeficiency virus type 1
Description:P04585[489-587]
Residue:99
BDBM50163391
NameBDBM50163391
Synonyms:CHEMBL195725 | {3-[(4-Amino-benzenesulfonyl)-isobutyl-amino]-1-benzyl-2-hydroxy-propyl}-carbamic acid tetrahydro-furan-3-yl ester
TypeSmall organic molecule
Emp. Form.C25H35N3O6S
Mol. Mass.505.627
SMILESCC(C)CN(CC(O)C(Cc1ccccc1)NC(=O)OC1CCOC1)S(=O)(=O)c1ccc(N)cc1