Reaction Details
TargetAlpha-2C adrenergic receptor
LigandBDBM50163483
Substrate/Competitorn/a
Meas. Tech.ChEMBL_302773 (CHEMBL852482)
Ki 0.300000±n/a nM
Citation Andrés, JIAlcázar, JAlonso, JMAlvarez, RMBakker, MHBiesmans, ICid, JMDe Lucas, AIFernández, JFont, LMHens, KAIturrino, LLenaerts, IMartínez, SMegens, AAPastor, JVermote, PCSteckler, T Discovery of a new series of centrally active tricyclic isoxazoles combining serotonin (5-HT) reuptake inhibition with alpha2-adrenoceptor blocking activity. J Med Chem48:2054-71 (2005) 
 
Alpha-2C adrenergic receptor
Name:Alpha-2C adrenergic receptor
Type:Enzyme
Mol. Mass.:49552.32
Organism:Homo sapiens (Human)
Description:P18825
Residue:462
BDBM50163483
NameBDBM50163483
Synonyms:CHEMBL175911 | Cyclopropanecarboxylic acid (3R,3aS)-3-[4-((E)-2-methyl-3-phenyl-allyl)-piperazin-1-ylmethyl]-3a,4-dihydro-3H-chromeno[4,3-c]isoxazol-7-yl ester
TypeSmall organic molecule
Emp. Form.C29H33N3O4
Mol. Mass.487.59
SMILESC\C(CN1CCN(C[C@@H]2ON=C3[C@H]2COc2cc(OC(=O)C4CC4)ccc32)CC1)=C/c1ccccc1