Reaction Details
TargetSodium-dependent serotonin transporter
LigandBDBM50024303
Substrate/Competitorn/a
Meas. Tech.ChEMBL_302646 (CHEMBL839936)
Ki 0.500000±n/a nM
Citation Andrés, JIAlcázar, JAlonso, JMAlvarez, RMBakker, MHBiesmans, ICid, JMDe Lucas, AIFernández, JFont, LMHens, KAIturrino, LLenaerts, IMartínez, SMegens, AAPastor, JVermote, PCSteckler, T Discovery of a new series of centrally active tricyclic isoxazoles combining serotonin (5-HT) reuptake inhibition with alpha2-adrenoceptor blocking activity. J Med Chem48:2054-71 (2005) 
 
Sodium-dependent serotonin transporter
Name:Sodium-dependent serotonin transporter
Type:Multi-pass membrane protein
Mol. Mass.:70322.51
Organism:Homo sapiens (Human)
Description:P31645
Residue:630
BDBM50024303
NameBDBM50024303
Synonyms:CHEMBL2112984
TypeSmall organic molecule
Emp. Form.C26H28N4O
Mol. Mass.412.5267
SMILES[H][C@@]12CNc3ccccc3C1=NO[C@H]2CN1CCN(Cc2ccc3ccccc3c2)CC1