Reaction Details
TargetC-C chemokine receptor type 3
LigandBDBM50163636
Substrate/Competitorn/a
Meas. Tech.ChEMBL_306770 (CHEMBL831867)
IC50 4±n/a nM
Citation De Lucca, GVKim, UTVargo, BJDuncia, JVSantella, JBGardner, DSZheng, CLiauw, AWang, ZEmmett, GWacker, DAWelch, PKCovington, MStowell, NCWadman, EADas, AMDavies, PYeleswaram, SGraden, DMSolomon, KANewton, RCTrainor, GLDecicco, CPKo, SS Discovery of CC chemokine receptor-3 (CCR3) antagonists with picomolar potency. J Med Chem48:2194-211 (2005) 
 
C-C chemokine receptor type 3
Name:C-C chemokine receptor type 3
Type:Enzyme
Mol. Mass.:41053.88
Organism:Homo sapiens (Human)
Description:P51677
Residue:355
BDBM50163636
NameBDBM50163636
Synonyms:1-((1R,2S)-2-(((S)-3-(4-fluorobenzyl)piperidin-1-yl)methyl)cyclohexyl)-3-(5-acetyl-4-methylthiazol-2-yl)urea CHEMBL195433
TypeSmall organic molecule
Emp. Form.C26H35FN4O2S
Mol. Mass.486.645
SMILESCC(=O)c1sc(NC(=O)N[C@@H]2CCCC[C@H]2CN2CCC[C@@H](Cc3ccc(F)cc3)C2)nc1C