Reaction Details
TargetC-C chemokine receptor type 3
LigandBDBM50163678
Substrate/Competitorn/a
Meas. Tech.ChEMBL_306801 (CHEMBL831708)
IC50 1±n/a nM
Citation De Lucca, GVKim, UTVargo, BJDuncia, JVSantella, JBGardner, DSZheng, CLiauw, AWang, ZEmmett, GWacker, DAWelch, PKCovington, MStowell, NCWadman, EADas, AMDavies, PYeleswaram, SGraden, DMSolomon, KANewton, RCTrainor, GLDecicco, CPKo, SS Discovery of CC chemokine receptor-3 (CCR3) antagonists with picomolar potency. J Med Chem48:2194-211 (2005) 
 
C-C chemokine receptor type 3
Name:C-C chemokine receptor type 3
Type:Enzyme
Mol. Mass.:41053.88
Organism:Homo sapiens (Human)
Description:P51677
Residue:355
BDBM50163678
NameBDBM50163678
Synonyms:1-[3,5-Bis-(1-methyl-1H-tetrazol-5-yl)-phenyl]-3-{(1R,2S)-2-[(S)-3-(4-fluoro-benzyl)-piperidin-1-ylmethyl]-cyclohexyl}-urea | CHEMBL382108
TypeSmall organic molecule
Emp. Form.C30H38FN11O
Mol. Mass.587.6942
SMILESCn1nnnc1-c1cc(NC(=O)N[C@@H]2CCCC[C@H]2CN2CCC[C@@H](Cc3ccc(F)cc3)C2)cc(c1)-c1nnnn1C