Reaction Details
TargetC-C chemokine receptor type 3
LigandBDBM50163638
Substrate/Competitorn/a
Meas. Tech.ChEMBL_306872 (CHEMBL828678)
IC50 71±n/a nM
Citation De Lucca, GVKim, UTVargo, BJDuncia, JVSantella, JBGardner, DSZheng, CLiauw, AWang, ZEmmett, GWacker, DAWelch, PKCovington, MStowell, NCWadman, EADas, AMDavies, PYeleswaram, SGraden, DMSolomon, KANewton, RCTrainor, GLDecicco, CPKo, SS Discovery of CC chemokine receptor-3 (CCR3) antagonists with picomolar potency. J Med Chem48:2194-211 (2005) 
 
C-C chemokine receptor type 3
Name:C-C chemokine receptor type 3
Type:Enzyme
Mol. Mass.:41053.88
Organism:Homo sapiens (Human)
Description:P51677
Residue:355
BDBM50163638
NameBDBM50163638
Synonyms:1-(3-Acetyl-phenyl)-3-[2-(4-fluoro-benzyl)-piperidin-1-yl]-urea | CHEMBL368683
TypeSmall organic molecule
Emp. Form.C21H24FN3O2
Mol. Mass.369.4326
SMILESCC(=O)c1cccc(NC(=O)NN2CCCCC2Cc2ccc(F)cc2)c1