Reaction Details
TargetC-C chemokine receptor type 3
LigandBDBM50163657
Substrate/Competitorn/a
Meas. Tech.ChEMBL_306872 (CHEMBL828678)
IC50 3±n/a nM
Citation De Lucca, GVKim, UTVargo, BJDuncia, JVSantella, JBGardner, DSZheng, CLiauw, AWang, ZEmmett, GWacker, DAWelch, PKCovington, MStowell, NCWadman, EADas, AMDavies, PYeleswaram, SGraden, DMSolomon, KANewton, RCTrainor, GLDecicco, CPKo, SS Discovery of CC chemokine receptor-3 (CCR3) antagonists with picomolar potency. J Med Chem48:2194-211 (2005) 
 
C-C chemokine receptor type 3
Name:C-C chemokine receptor type 3
Type:Enzyme
Mol. Mass.:41053.88
Organism:Homo sapiens (Human)
Description:P51677
Residue:355
BDBM50163657
NameBDBM50163657
Synonyms:1-(3-Acetyl-phenyl)-3-[(1R,2S)-2-(4-benzyl-piperidin-1-ylmethyl)-cyclohexyl]-urea | CHEMBL369073
TypeSmall organic molecule
Emp. Form.C28H37N3O2
Mol. Mass.447.6123
SMILESCC(=O)c1cccc(NC(=O)N[C@@H]2CCCC[C@H]2CN2CCC(Cc3ccccc3)CC2)c1