Reaction Details
TargetC-C chemokine receptor type 3
LigandBDBM50163634
Substrate/Competitorn/a
Meas. Tech.ChEMBL_306770 (CHEMBL831867)
IC50 1±n/a nM
Citation De Lucca, GVKim, UTVargo, BJDuncia, JVSantella, JBGardner, DSZheng, CLiauw, AWang, ZEmmett, GWacker, DAWelch, PKCovington, MStowell, NCWadman, EADas, AMDavies, PYeleswaram, SGraden, DMSolomon, KANewton, RCTrainor, GLDecicco, CPKo, SS Discovery of CC chemokine receptor-3 (CCR3) antagonists with picomolar potency. J Med Chem48:2194-211 (2005) 
 
C-C chemokine receptor type 3
Name:C-C chemokine receptor type 3
Type:Enzyme
Mol. Mass.:41053.88
Organism:Homo sapiens (Human)
Description:P51677
Residue:355
BDBM50163634
NameBDBM50163634
Synonyms:1-((1R,2S)-2-(((S)-3-(4-fluorobenzyl)piperidin-1-yl)methyl)cyclohexyl)-3-(3-(1-methyl-1H-tetrazol-5-yl)phenyl)urea CHEMBL363840
TypeSmall organic molecule
Emp. Form.C28H36FN7O
Mol. Mass.505.6301
SMILESCn1nnnc1-c1cccc(NC(=O)N[C@@H]2CCCC[C@H]2CN2CCC[C@@H](Cc3ccc(F)cc3)C2)c1