Reaction Details
TargetC-C chemokine receptor type 3
LigandBDBM50163664
Substrate/Competitorn/a
Meas. Tech.ChEMBL_306872 (CHEMBL828678)
IC50 9±n/a nM
Citation De Lucca, GVKim, UTVargo, BJDuncia, JVSantella, JBGardner, DSZheng, CLiauw, AWang, ZEmmett, GWacker, DAWelch, PKCovington, MStowell, NCWadman, EADas, AMDavies, PYeleswaram, SGraden, DMSolomon, KANewton, RCTrainor, GLDecicco, CPKo, SS Discovery of CC chemokine receptor-3 (CCR3) antagonists with picomolar potency. J Med Chem48:2194-211 (2005) 
 
C-C chemokine receptor type 3
Name:C-C chemokine receptor type 3
Type:Enzyme
Mol. Mass.:41053.88
Organism:Homo sapiens (Human)
Description:P51677
Residue:355
BDBM50163664
NameBDBM50163664
Synonyms:1-[(1R,2S)-2-(4-Benzyl-piperidin-1-ylmethyl)-cyclohexyl]-3-(3-cyano-phenyl)-urea | CHEMBL175679
TypeSmall organic molecule
Emp. Form.C27H34N4O
Mol. Mass.430.5851
SMILESO=C(N[C@@H]1CCCC[C@H]1CN1CCC(Cc2ccccc2)CC1)Nc1cccc(c1)C#N