Reaction Details
TargetC-C chemokine receptor type 3
LigandBDBM50163683
Substrate/Competitorn/a
Meas. Tech.ChEMBL_306872 (CHEMBL828678)
IC50 2.3±n/a nM
Citation De Lucca, GVKim, UTVargo, BJDuncia, JVSantella, JBGardner, DSZheng, CLiauw, AWang, ZEmmett, GWacker, DAWelch, PKCovington, MStowell, NCWadman, EADas, AMDavies, PYeleswaram, SGraden, DMSolomon, KANewton, RCTrainor, GLDecicco, CPKo, SS Discovery of CC chemokine receptor-3 (CCR3) antagonists with picomolar potency. J Med Chem48:2194-211 (2005) 
 
C-C chemokine receptor type 3
Name:C-C chemokine receptor type 3
Type:Enzyme
Mol. Mass.:41053.88
Organism:Homo sapiens (Human)
Description:P51677
Residue:355
BDBM50163683
NameBDBM50163683
Synonyms:1-{(1R,2S)-2-[(S)-3-(4-Fluoro-benzyl)-piperidin-1-ylmethyl]-cyclohexyl}-3-[1,3,4]thiadiazol-2-yl-urea | CHEMBL364977
TypeSmall organic molecule
Emp. Form.C22H30FN5OS
Mol. Mass.431.57
SMILESFc1ccc(C[C@@H]2CCCN(C[C@@H]3CCCC[C@H]3NC(=O)Nc3nncs3)C2)cc1