Reaction Details
TargetC-C chemokine receptor type 3
LigandBDBM50410313
Substrate/Competitorn/a
Meas. Tech.ChEMBL_306872 (CHEMBL828678)
IC50 28±n/a nM
Citation De Lucca, GVKim, UTVargo, BJDuncia, JVSantella, JBGardner, DSZheng, CLiauw, AWang, ZEmmett, GWacker, DAWelch, PKCovington, MStowell, NCWadman, EADas, AMDavies, PYeleswaram, SGraden, DMSolomon, KANewton, RCTrainor, GLDecicco, CPKo, SS Discovery of CC chemokine receptor-3 (CCR3) antagonists with picomolar potency. J Med Chem48:2194-211 (2005) 
 
C-C chemokine receptor type 3
Name:C-C chemokine receptor type 3
Type:Enzyme
Mol. Mass.:41053.88
Organism:Homo sapiens (Human)
Description:P51677
Residue:355
BDBM50410313
NameBDBM50410313
Synonyms:CHEMBL2112987
TypeSmall organic molecule
Emp. Form.C27H37N3O2
Mol. Mass.435.6016
SMILESCOc1cccc(NC(=O)N[C@@H]2CCCC[C@H]2CN2CCCC(Cc3ccccc3)C2)c1