Reaction Details
TargetC-C chemokine receptor type 3
LigandBDBM50410318
Substrate/Competitorn/a
Meas. Tech.ChEMBL_306872 (CHEMBL828678)
IC50 9±n/a nM
Citation De Lucca, GVKim, UTVargo, BJDuncia, JVSantella, JBGardner, DSZheng, CLiauw, AWang, ZEmmett, GWacker, DAWelch, PKCovington, MStowell, NCWadman, EADas, AMDavies, PYeleswaram, SGraden, DMSolomon, KANewton, RCTrainor, GLDecicco, CPKo, SS Discovery of CC chemokine receptor-3 (CCR3) antagonists with picomolar potency. J Med Chem48:2194-211 (2005) 
 
C-C chemokine receptor type 3
Name:C-C chemokine receptor type 3
Type:Enzyme
Mol. Mass.:41053.88
Organism:Homo sapiens (Human)
Description:P51677
Residue:355
BDBM50410318
NameBDBM50410318
Synonyms:CHEMBL2096764
TypeSmall organic molecule
Emp. Form.C27H33FN4O
Mol. Mass.448.5755
SMILESFc1ccc(C[C@@H]2CCCN(C[C@@H]3CCCC[C@H]3NC(=O)Nc3cccc(c3)C#N)C2)cc1