Reaction Details
TargetE3 ubiquitin-protein ligase Mdm2
LigandBDBM50163928
Substrate/Competitorn/a
Meas. Tech.ChEMBL_306060 (CHEMBL874553)
IC50 3600±n/a nM
Citation Raboisson, PMarugán, JJSchubert, CKoblish, HKLu, TZhao, SPlayer, MRMaroney, ACReed, RLHuebert, NDLattanze, JParks, DJCummings, MD Structure-based design, synthesis, and biological evaluation of novel 1,4-diazepines as HDM2 antagonists. Bioorg Med Chem Lett15:1857-61 (2005) 
 
E3 ubiquitin-protein ligase Mdm2
Name:E3 ubiquitin-protein ligase Mdm2
Type:Oncoprotein
Mol. Mass.:55196.54
Organism:Homo sapiens (Human)
Description:Q00987
Residue:491
BDBM50163928
NameBDBM50163928
Synonyms:5-{(S)-7-(2-Bromo-phenyl)-3-(4-chloro-phenyl)-4-[(R)-1-(4-chloro-phenyl)-ethyl]-2,5-dioxo-2,3,4,5-tetrahydro-[1,4]diazepin-1-yl}-pentanoic acid | CHEMBL427316
TypeSmall organic molecule
Emp. Form.C30H27BrCl2N2O4
Mol. Mass.630.356
SMILESC[C@@H](N1[C@@H](c2ccc(Cl)cc2)C(=O)N(CCCCC(O)=O)C(=CC1=O)c1ccccc1Br)c1ccc(Cl)cc1