Reaction Details
TargetAmyloid-beta precursor protein
LigandBDBM50163996
Substrate/Competitorn/a
Meas. Tech.ChEMBL_317564 (CHEMBL825229)
EC50 640±n/a nM
Citation Gundersen, EFan, KHaas, KHuryn, DSteven Jacobsen, JKreft, AMartone, RMayer, SSonnenberg-Reines, JSun, SCZhou, H Molecular-modeling based design, synthesis, and activity of substituted piperidines as gamma-secretase inhibitors. Bioorg Med Chem Lett15:1891-4 (2005) 
 
Amyloid-beta precursor protein
Name:Amyloid-beta precursor protein
Type:Single-pass type I membrane protein
Mol. Mass.:86890.41
Organism:Homo sapiens (Human)
Description:P05067
Residue:770
BDBM50163996
NameBDBM50163996
Synonyms:4-(4-Chloro-benzenesulfonyl)-4-(2-methoxy-phenyl)-piperidine-1-carboxylic acid ethyl ester ethyl 4-(4-chlorophenylsulfonyl)-4-(2-methoxyphenyl)piperidine-1-carboxylate
TypeSmall organic molecule
Emp. Form.C21H24ClNO5S
Mol. Mass.437.937
SMILESCCOC(=O)N1CCC(CC1)(c1ccccc1OC)S(=O)(=O)c1ccc(Cl)cc1