Reaction Details
TargetSodium channel protein type 9 subunit alpha
LigandBDBM50164067
Substrate/Competitorn/a
Meas. Tech.ChEMBL_313003 (CHEMBL874197)
IC50 260±n/a nM
Citation Shao, PPOk, DFisher, MHGarcia, MLKaczorowski, GJLi, CLyons, KAMartin, WJMeinke, PTPriest, BTSmith, MMWyvratt, MJYe, FParsons, WH Novel cyclopentane dicarboxamide sodium channel blockers as a potential treatment for chronic pain. Bioorg Med Chem Lett15:1901-7 (2005) 
 
Sodium channel protein type 9 subunit alpha
Name:Sodium channel protein type 9 subunit alpha
Type:Protein
Mol. Mass.:226375.97
Organism:Homo sapiens (Human)
Description:Q15858
Residue:1988
BDBM50164067
NameBDBM50164067
Synonyms:(1S,2S)-2-[(2''-Methanesulfonyl-biphenyl-4-ylmethyl)-amino]-cyclopentanecarboxylic acid ([2,2'']bithiophenyl-5-ylmethyl)-amide | CHEMBL182686
TypeSmall organic molecule
Emp. Form.C29H30N2O3S3
Mol. Mass.550.755
SMILESCS(=O)(=O)c1ccccc1-c1ccc(CN[C@H]2CCC[C@@H]2C(=O)NCc2ccc(s2)-c2cccs2)cc1