Reaction Details
TargetSodium channel protein type 9 subunit alpha
LigandBDBM50164037
Substrate/Competitorn/a
Meas. Tech.ChEMBL_313003 (CHEMBL874197)
IC50 840±n/a nM
Citation Shao, PPOk, DFisher, MHGarcia, MLKaczorowski, GJLi, CLyons, KAMartin, WJMeinke, PTPriest, BTSmith, MMWyvratt, MJYe, FParsons, WH Novel cyclopentane dicarboxamide sodium channel blockers as a potential treatment for chronic pain. Bioorg Med Chem Lett15:1901-7 (2005) 
 
Sodium channel protein type 9 subunit alpha
Name:Sodium channel protein type 9 subunit alpha
Type:Protein
Mol. Mass.:226375.97
Organism:Homo sapiens (Human)
Description:Q15858
Residue:1988
BDBM50164037
NameBDBM50164037
Synonyms:(1R,2R)-3-Methylene-cyclopropane-1,2-dicarboxylic acid 1-[([2,2'']bithiophenyl-5-ylmethyl)-amide] 2-[(2''-sulfamoyl-biphenyl-4-ylmethyl)-amide] | CHEMBL361535
TypeSmall organic molecule
Emp. Form.C28H25N3O4S3
Mol. Mass.563.711
SMILESNS(=O)(=O)c1ccccc1-c1ccc(CNC(=O)[C@@H]2[C@@H](C(=O)NCc3ccc(s3)-c3cccs3)C2=C)cc1