Reaction Details
TargetSodium channel protein type 9 subunit alpha
LigandBDBM50164046
Substrate/Competitorn/a
Meas. Tech.ChEMBL_308686 (CHEMBL834126)
Ki 2100±n/a nM
Citation Shao, PPOk, DFisher, MHGarcia, MLKaczorowski, GJLi, CLyons, KAMartin, WJMeinke, PTPriest, BTSmith, MMWyvratt, MJYe, FParsons, WH Novel cyclopentane dicarboxamide sodium channel blockers as a potential treatment for chronic pain. Bioorg Med Chem Lett15:1901-7 (2005) 
 
Sodium channel protein type 9 subunit alpha
Name:Sodium channel protein type 9 subunit alpha
Type:Protein
Mol. Mass.:226375.97
Organism:Homo sapiens (Human)
Description:Q15858
Residue:1988
BDBM50164046
NameBDBM50164046
Synonyms:(1S,2S)-Cyclohexane-1,2-dicarboxylic acid 1-[([2,2'']bithiophenyl-5-ylmethyl)-amide] 2-[(2''-sulfamoyl-biphenyl-4-ylmethyl)-amide] | CHEMBL368692
TypeSmall organic molecule
Emp. Form.C30H31N3O4S3
Mol. Mass.593.78
SMILESNS(=O)(=O)c1ccccc1-c1ccc(CNC(=O)[C@H]2CCCC[C@@H]2C(=O)NCc2ccc(s2)-c2cccs2)cc1