Reaction Details
TargetSodium channel protein type 9 subunit alpha
LigandBDBM50164048
Substrate/Competitorn/a
Meas. Tech.ChEMBL_308686 (CHEMBL834126)
Ki 50±n/a nM
Citation Shao, PPOk, DFisher, MHGarcia, MLKaczorowski, GJLi, CLyons, KAMartin, WJMeinke, PTPriest, BTSmith, MMWyvratt, MJYe, FParsons, WH Novel cyclopentane dicarboxamide sodium channel blockers as a potential treatment for chronic pain. Bioorg Med Chem Lett15:1901-7 (2005) 
 
Sodium channel protein type 9 subunit alpha
Name:Sodium channel protein type 9 subunit alpha
Type:Protein
Mol. Mass.:226375.97
Organism:Homo sapiens (Human)
Description:Q15858
Residue:1988
BDBM50164048
NameBDBM50164048
Synonyms:(1S,2S)-Cyclopentane-1,2-dicarboxylic acid 1-[([2,2'']bithiophenyl-5-ylmethyl)-amide] 2-{[1-(2''-sulfamoyl-biphenyl-4-yl)-ethyl]-amide} | CHEMBL362660
TypeSmall organic molecule
Emp. Form.C30H31N3O4S3
Mol. Mass.593.78
SMILESCC(NC(=O)[C@H]1CCC[C@@H]1C(=O)NCc1ccc(s1)-c1cccs1)c1ccc(cc1)-c1ccccc1S(N)(=O)=O