Reaction Details
TargetSodium channel protein type 9 subunit alpha
LigandBDBM50164041
Substrate/Competitorn/a
Meas. Tech.ChEMBL_308686 (CHEMBL834126)
Ki 510±n/a nM
Citation Shao, PPOk, DFisher, MHGarcia, MLKaczorowski, GJLi, CLyons, KAMartin, WJMeinke, PTPriest, BTSmith, MMWyvratt, MJYe, FParsons, WH Novel cyclopentane dicarboxamide sodium channel blockers as a potential treatment for chronic pain. Bioorg Med Chem Lett15:1901-7 (2005) 
 
Sodium channel protein type 9 subunit alpha
Name:Sodium channel protein type 9 subunit alpha
Type:Protein
Mol. Mass.:226375.97
Organism:Homo sapiens (Human)
Description:Q15858
Residue:1988
BDBM50164041
NameBDBM50164041
Synonyms:(1S,2S)-Cyclopentane-1,2-dicarboxylic acid 1-[(2''-sulfamoyl-biphenyl-4-ylmethyl)-amide] 2-[(2''-trifluoromethyl-biphenyl-4-ylmethyl)-amide] | CHEMBL360700
TypeSmall organic molecule
Emp. Form.C34H32F3N3O4S
Mol. Mass.635.696
SMILESNS(=O)(=O)c1ccccc1-c1ccc(CNC(=O)[C@H]2CCC[C@@H]2C(=O)NCc2ccc(cc2)-c2ccccc2C(F)(F)F)cc1