Reaction Details
TargetSodium channel protein type 9 subunit alpha
LigandBDBM50164028
Substrate/Competitorn/a
Meas. Tech.ChEMBL_313003 (CHEMBL874197)
IC50 1400±n/a nM
Citation Shao, PPOk, DFisher, MHGarcia, MLKaczorowski, GJLi, CLyons, KAMartin, WJMeinke, PTPriest, BTSmith, MMWyvratt, MJYe, FParsons, WH Novel cyclopentane dicarboxamide sodium channel blockers as a potential treatment for chronic pain. Bioorg Med Chem Lett15:1901-7 (2005) 
 
Sodium channel protein type 9 subunit alpha
Name:Sodium channel protein type 9 subunit alpha
Type:Protein
Mol. Mass.:226375.97
Organism:Homo sapiens (Human)
Description:Q15858
Residue:1988
BDBM50164028
NameBDBM50164028
Synonyms:CHEMBL182564 | N-[2,2'']Bithiophenyl-5-ylmethyl-2,3-dimethyl-N''-(2''-sulfamoyl-biphenyl-4-ylmethyl)-succinamide
TypeSmall organic molecule
Emp. Form.C28H29N3O4S3
Mol. Mass.567.743
SMILESCC(C(C)C(=O)NCc1ccc(cc1)-c1ccccc1S(N)(=O)=O)C(=O)NCc1ccc(s1)-c1cccs1