Reaction Details
TargetCarbonic anhydrase 9
LigandBDBM50164079
Substrate/Competitorn/a
Meas. Tech.ChEMBL_302183 (CHEMBL829423)
Ki 18500000±n/a nM
Citation Innocenti, AAntel, JWurl, MVullo, DFirnges, MAScozzafava, ASupuran, CT Carbonic anhydrase inhibitors. Inhibition of isozymes I, II, IV, V and IX with complex fluorides, chlorides and cyanides. Bioorg Med Chem Lett15:1909-13 (2005) 
 
Carbonic anhydrase 9
Name:Carbonic anhydrase 9
Type:Enzyme
Mol. Mass.:49669.03
Organism:Homo sapiens (Human)
Description:Catalytic domain of human cloned isozyme was used in the assay
Residue:459
BDBM50164079
NameBDBM50164079
Synonyms:(OC-6-11)-hexafluoroaluminate(3-) CHEMBL181624 hexafluoridoaluminate(3-) | hexafluoroaluminate(3-)
TypeSmall organic molecule
Emp. Form.AlF6
Mol. Mass.140.9736035
SMILESF[Al-3](F)(F)(F)(F)F