Reaction Details
TargetCarbonic anhydrase 9
LigandBDBM50164081
Substrate/Competitorn/a
Meas. Tech.ChEMBL_302183 (CHEMBL829423)
Ki 35200000±n/a nM
Citation Innocenti, AAntel, JWurl, MVullo, DFirnges, MAScozzafava, ASupuran, CT Carbonic anhydrase inhibitors. Inhibition of isozymes I, II, IV, V and IX with complex fluorides, chlorides and cyanides. Bioorg Med Chem Lett15:1909-13 (2005) 
 
Carbonic anhydrase 9
Name:Carbonic anhydrase 9
Type:Enzyme
Mol. Mass.:49669.03
Organism:Homo sapiens (Human)
Description:Catalytic domain of human cloned isozyme was used in the assay
Residue:459
BDBM50164081
NameBDBM50164081
Synonyms:CHEMBL366920 tetrachloridoplatinate(2-)tetrachloridoplatinate(II) | tetrachloroplatinate(2-)
TypeSmall organic molecule
Emp. Form.Cl4Pt
Mol. Mass.336.897
SMILESCl[Pt--](Cl)(Cl)Cl