Reaction Details
TargetCarbonic anhydrase 1
LigandBDBM50164082
Substrate/Competitorn/a
Meas. Tech.ChEMBL_302184 (CHEMBL829424)
Ki 6900.0±n/a nM
Citation Innocenti, AAntel, JWurl, MVullo, DFirnges, MAScozzafava, ASupuran, CT Carbonic anhydrase inhibitors. Inhibition of isozymes I, II, IV, V and IX with complex fluorides, chlorides and cyanides. Bioorg Med Chem Lett15:1909-13 (2005) 
 
Carbonic anhydrase 1
Name:Carbonic anhydrase 1
Type:Enzyme
Mol. Mass.:28873.37
Organism:Homo sapiens (Human)
Description:P00915
Residue:261
BDBM50164082
NameBDBM50164082
Synonyms:CHEMBL181104 | [Cu(CN)2]-
TypeSmall organic molecule
Emp. Form.C2CuN2
Mol. Mass.115.581
SMILESN#C[Cu-]C#N