Reaction Details
TargetCarbonic anhydrase 9
LigandBDBM50164077
Substrate/Competitorn/a
Meas. Tech.ChEMBL_302183 (CHEMBL829423)
Ki 3630000±n/a nM
Citation Innocenti, AAntel, JWurl, MVullo, DFirnges, MAScozzafava, ASupuran, CT Carbonic anhydrase inhibitors. Inhibition of isozymes I, II, IV, V and IX with complex fluorides, chlorides and cyanides. Bioorg Med Chem Lett15:1909-13 (2005) 
 
Carbonic anhydrase 9
Name:Carbonic anhydrase 9
Type:Enzyme
Mol. Mass.:49669.03
Organism:Homo sapiens (Human)
Description:Catalytic domain of human cloned isozyme was used in the assay
Residue:459
BDBM50164077
NameBDBM50164077
Synonyms:CHEMBL181256 hexachloridoplatinate(2-)hexachloridoplatinate(IV) | hexachloroplatinate(2-)
TypeSmall organic molecule
Emp. Form.Cl6Pt
Mol. Mass.407.803
SMILESCl[Pt--](Cl)(Cl)(Cl)(Cl)Cl